{"text_format":"1","workbook":"xlsx","n_sheets":11,"sheets":["Series Circuit Parameters","Lamp Load","LED Load","Sign Load","In-pavement RGL","Elevated RGL","Stop Bar","Other Loads","Load Summary","variables","SL Table"],"not_rendered":{"charts":0,"images":3,"macros":1,"external_links":0,"defined_names":60,"comments":0,"pivot_tables":0},"unopened":[],"bounds":{"document_bytes":16777216,"sheet_cells":100000,"rows_first":2000,"rows_last":500,"rows_between":2000,"halvings":0,"cell_chars":16384,"cell_head_chars":4096},"cells_cut":0,"cells_raw":0,"read":"whole","date_system":"1900"}

{"sheet":"Series Circuit Parameters","index":0,"n_rows":29,"n_cols":8,"rows_kept":29,"cut":false,"hidden":false,"merged":[[16,3,16,4],[3,1,3,6],[5,1,5,6],[25,5,25,6],[2,3,2,7],[4,3,4,7],[8,3,8,4]]}
[]
[null," SERIES CIRCUIT PARAMETERS"]
[null,"A. ","Airport Name","<Enter Airport Name Here>"]
[]
[null,"B.","Circuit Identification (if applicable)","<Enter Circuit ID as required>"]
[]
[null,"C.","Maximum CCR Output Current",6.6," Amps "]
[]
[null,"D.","Number of CCR Steps","5-Step (2.8A-6.6A)"]
[]
[null,"E.","Input Voltage","480Vac"]
[]
[null,"F.","Frequency","60Hz"]
[]
[null,"G.","Series Circuit Cable Wire Length Units","Feet"]
[]
[null,"H.","CCR Architecture","Ferroresonant"]
[]
[null,"I.","Estimated roundtrip length of L-824 series circuit wire",10000,{"$f":"\" \" & $D$15 & \"\"","v":" Feet"}]
[]
{"$rows_left_out":10}
{"sheet":"Lamp Load","index":1,"n_rows":126,"n_cols":15,"rows_kept":126,"cut":false,"hidden":false,"merged":[[2,0,123,0],[37,7,37,11],[41,3,41,4],[7,7,7,11],[5,7,5,8],[35,7,35,8],[65,7,65,8],[27,9,27,14],[31,1,31,15],[61,1,61,15],[79,3,80,5],[79,7,79,8],[104,3,104,10],[97,7,97,11],[11,3,11,4],[117,9,117,14],[121,13,123,15],[2,16,123,17],[3,14,11,14],[13,14,15,14],[33,14,41,14],[43,14,45,14],[57,9,57,14],[63,14,71,14],[73,14,75,14],[87,9,87,14],[93,14,101,14],[103,14,105,14],[109,3,110,5],[109,7,109,8],[13,3,13,6],[19,3,20,5],[19,7,19,8],[14,3,14,10],[43,3,43,6],[44,3,44,10],[101,3,101,4],[91,1,91,15],[49,3,50,5],[103,3,103,6],[74,3,74,10],[67,7,67,11],[71,3,71,4],[73,3,73,6],[95,7,95,8],[49,7,49,8]]}
[]
[null,"  Tungsten Halogen / Incandescent Lamp Fixture Load"]
[]
[null,"1.","Fixture Load Calculator #1",null,null,null,null,null,null,null,null,null,null,"*","Note: If fixture has multiple lamps, enter maximum wattage when maximum number of lamps are on. Example: For a bi-directional L-852D (with two 30W lamps) where both lamps can be on at the same time, enter 60W."]
[]
[null,null,"A.","Fixture Description",null,null,null,"L-850C"]
[]
[null,null,"B.","Manufacturer",null,null,null,"ADB Safegate"]
[]
[null,null,"C.","Number of Light Fixtures",null,null,null,100]
[]
[null,null,"D.","Fixture Wattage*",null,null,null,45," W"]
[]
[null,null,"E.","Are long secondary wires present?**",null,null,null,"No",null,null,null,null,null,"**","Note: \"No\" is automatically assumed if transformer is located underneath fixture."]
[]
[null,null,null,"1. Estimated roundtrip length of Isol. Tx. secondary wire",null,null,null,null,null,null,{"$f":"\" \" & 'Series Circuit Parameters'!$D$15 & \"\"","v":" Feet"}]
[]
[null,null,null,"2. Isolation Transformer Secondary Wire Gauge",null,null,null,null,null,null," AWG"]
[]
[null,null,null,"3. Wire Resistance",null,null,{"$f":"IF(J18,VLOOKUP(J18,variables!$I$8:$K$9,variables!$J$1,FALSE),0)","v":0},{"$f":"\" ohms / 1000 \" & 'Series Circuit Parameters'!$D$15","v":" ohms / 1000 Feet"},null,{"$f":"ROUND(('Series Circuit Parameters'!$D$7^2)*(G20*(J16/1000)),1)","v":0}," VA"]
{"$rows_left_out":107}
{"sheet":"LED Load","index":2,"n_rows":129,"n_cols":13,"rows_kept":129,"cut":false,"hidden":false,"merged":[[2,0,126,0],[37,7,37,11],[41,3,41,4],[6,7,6,11],[49,3,50,5],[31,1,31,13],[12,3,12,6],[13,3,13,10],[14,3,15,8],[16,3,16,8],[68,7,68,11],[44,3,44,10],[72,3,72,4],[63,1,63,13],[122,1,122,5],[122,12,122,13],[18,3,19,5],[18,7,18,8],[43,3,43,6],[80,3,81,5],[2,15,2,19],[4,15,8,15],[74,3,74,6],[62,1,62,13],[47,3,47,8],[10,3,10,4],[126,1,126,13],[75,3,75,10],[76,3,77,8],[78,3,78,8],[125,2,125,5],[119,1,119,13],[121,1,121,13],[80,7,80,8],[93,1,93,13],[123,1,123,13],[125,7,125,13],[107,3,108,8],[99,7,99,11],[103,3,103,4],[109,3,109,8],[124,1,124,13],[111,7,111,8],[105,3,105,6],[111,3,112,5],[45,3,46,8],[106,3,106,10],[49,7,49,8]]}
[]
[null,"  LED FIXTURE LOAD",null,null,null,null,"Note:  Use the \"Other Loads\" sheet to enter LED PAPI, REIL and Wind Cone data."]
[null,"1.","Fixture Load Calculator #1"]
[]
[null,null,"A.","Fixture Description",null,null,null,"L-850B(L)"]
[]
[null,null,"B.","Manufacturer",null,null,null,"ADB Safegate"]
[]
[null,null,"C.","Number of Light Fixtures",null,null,null,20]
[]
[null,null,"D.","LED fixture load",null,null,null,12," VA"]
[]
[null,null,"E.","Are long secondary wires present?",null,null,null,"No"]
[null,null,null,"Note: Zero is automatically assumed if transformer is located underneath fixture.  "]
[null,null,null,"1. Estimated roundtrip length of Isolation Transformer secondary wire",null,null,null,null,null,null,{"$f":"\" \" & 'Series Circuit Parameters'!$D$15 & \"\"","v":" Feet"}]
[]
[null,null,null,"2. Isolation Transformer Secondary Wire Gauge",null,null,null,null,null,null," AWG"]
[]
[null,null,null,"3. Wire Resistance",null,null,{"$f":"IF(J17,VLOOKUP(J17,variables!$I$8:$K$9,variables!$J$1,FALSE),0)","v":0},{"$f":"\" ohms / 1000 \" & 'Series Circuit Parameters'!$D$15","v":" ohms / 1000 Feet"},null,{"$f":"ROUND(('Series Circuit Parameters'!$D$7^2)*(G19*(J15/1000)),1)","v":0}," VA"]
[]
{"$rows_left_out":110}
{"sheet":"Sign Load","index":3,"n_rows":125,"n_cols":9,"rows_kept":125,"cut":false,"hidden":false,"merged":[[121,1,121,7],[27,2,27,7],[28,1,28,7],[43,3,44,3],[43,5,43,6],[61,5,61,6],[97,1,97,7],[63,4,63,6],[71,5,71,7],[91,5,91,6],[67,5,67,6],[67,3,68,3],[73,1,73,7],[115,3,116,3],[115,5,115,6],[1,0,1,13],[19,3,20,3],[19,5,19,6],[13,5,13,6],[15,4,15,6],[13,9,13,13],[18,9,18,13],[3,0,122,0],[37,5,37,6],[39,4,39,6],[52,1,52,7],[50,1,50,7],[51,2,51,7],[85,5,85,6],[111,4,111,6],[49,1,49,7],[26,1,26,7],[6,9,6,13],[19,9,19,10],[15,9,15,13],[20,11,20,12],[109,5,109,6],[87,4,87,6],[91,3,92,3],[4,9,4,13],[20,10,23,10],[25,1,25,7],[12,9,12,13],[7,9,7,13],[9,9,9,13],[8,9,8,13],[10,9,10,13],[11,9,11,13],[24,9,24,13],[23,11,23,12],[22,11,22,12],[21,11,21,12]]}
[]
["  FAA L-858 / ICAO / TP312 Sign Load"]
[]
[null,"1.","Sign Load No. 1 Calculator",null,null,null,null,null,"Reference Data: "]
[]
[null,null,"A.","Sign Manufacturer",null,null,"ADB Safegate"]
[]
[null,null,"B.","Sign Size",null,null,"Size 2"]
[]
[null,null,"C.","Sign Modules (FAA) or Sign Length (ICAO/TP312)",null,null,"4 Module"]
[]
[null,null,"D.","Light Source",null,null,"LED"]
[]
[null,null,"E.","Sign Power Architecture",null,"FAA LED"]
[]
[null,null,"F.","Sign Style","Style 2 (4.8A - 6.6A) 3-step"]
[]
[null,null,"G.","Sign Transformer Used",null,null,300," W"]
[]
[null,null,"H.","Sign VA as seen on the primary of the isolation transformer",null,255,null," VA"]
{"$rows_left_out":106}
{"sheet":"In-pavement RGL","index":4,"n_rows":45,"n_cols":12,"rows_kept":45,"cut":false,"hidden":false,"merged":[[38,6,39,8],[40,6,40,8],[41,6,41,8],[21,6,21,7],[32,1,32,8],[29,2,29,7],[25,2,25,9],[23,8,23,10],[27,2,27,9],[33,2,33,5],[17,2,18,7],[34,1,36,1],[24,1,24,5],[19,2,19,7],[21,2,22,4],[31,2,31,5],[35,2,35,12],[34,2,34,12],[36,2,36,12],[9,7,9,8],[5,2,5,5],[15,2,15,5],[6,2,6,7],[11,2,11,5],[10,1,10,7],[12,2,12,8],[14,1,14,7]]}
[]
[]
[]
[]
[null," In-Pavement Runway Guard Light (IRGL) Load"]
[null,"A.","Fixture Description",null,null,null,"L-852G(L)"]
[null,null,"Note: Use the Stop Bar tab if the fixture is a L-852G/S."]
[null,"B.","Fixture Manufacturer",null,null,null,"ADB Safegate"]
[]
[null,"C.","Fixture Load",null,null,null,105," W or VA (LED)"]
[]
[null,"D.","Monitored or Unmonitored?",null,null,null,"Un-Monitored"]
[null,null,"Note: Selecting Unmonitored zeros out any load associated with the Master."]
[null,"E.","Isolation Transformer Wattage",null,null,null,45," W","  Select from dropdown or type-in"]
[]
[null,"F.","Are long secondary wires present?",null,null,null,"No"]
[null,null,"Note: Zero is automatically assumed if transformer is located underneath fixture.  "]
[null,null,"1. Estimated roundtrip length of Isolation Transformer secondary wire",null,null,null,null,null,null,{"$f":"\" \" & 'Series Circuit Parameters'!$D$15 & \"\"","v":" Feet"}]
[]
[null,null,"2. Isolation Transformer Secondary Wire Gauge",null,null,null,null,null,null," AWG"]
{"$rows_left_out":26}
{"sheet":"Elevated RGL","index":5,"n_rows":42,"n_cols":11,"rows_kept":42,"cut":false,"hidden":false,"merged":[[14,2,15,6],[18,6,18,7],[28,2,28,5]]}
[]
[" Elevated L-804 Runway Guard Light (RGL)"]
[]
[null,"A.","Fixture Description",null,null,null,"L-804"]
[null,null,"Note: Use the Stop Bar tab if the L-804 is on the same circuit as the Stop Bar."]
[null,"B.","Fixture Manufacturer",null,null,null,"ADB Safegate"]
[]
[null,"C.","Fixture Load",null,null,null,100," W or VA (LED)"]
[null,null,"Note: Enter the wattage for only one of the two lamps in the L-804 (since only one is on at a time.)"]
[null,"D. ","Type of Fixture Pulsing Device Used",null,null,null,"BRITE III Dual Remote (AGLAS)"]
[null,null,"Note: Entering PCB version inserts load for PCB only and auto zeros anything associated with BRITE / AGLAS / LINC 360"]
[null,null,"1. Pulsing Device Load.",null,null,null,null,"Note:Enter zero if LED.",25," VA"]
[null,"E.","Are long secondary wires present?",null,null,null,"No"]
[null,null,"Note: Zero is automatically assumed if transformer is located underneath fixture.  "]
[null,null,"1. Estimated roundtrip length of Isolation Transformer secondary wire",null,null,null,null,null,null,{"$f":"\" \" & 'Series Circuit Parameters'!$D$15 & \"\"","v":" Feet"}]
[]
[null,null,"2. Isolation Transformer Secondary Wire Gauge",null,null,null,null,null,null," AWG"]
[]
[null,null,"3. Wire Resistance",null,null,null,{"$f":"\" ohms / 1000 \" & 'Series Circuit Parameters'!$D$15","v":" ohms / 1000 Feet"},null,{"$f":"ROUND(('Series Circuit Parameters'!$D$7^2)*(F19*(I15/1000)),1)","v":0}," VA"]
[]
{"$rows_left_out":23}
{"sheet":"Stop Bar","index":6,"n_rows":136,"n_cols":11,"rows_kept":136,"cut":false,"hidden":false,"merged":[[117,4,117,5],[86,2,86,5],[74,2,74,5],[119,2,119,5],[97,1,98,1],[84,4,84,5],[97,2,97,8],[89,1,89,5],[78,8,80,8],[72,2,72,5],[11,2,11,3],[44,2,44,5],[21,4,21,5],[15,2,15,5],[40,2,40,4],[76,2,76,5],[78,2,78,5],[50,4,50,5]]}
[]
[null,"Stop Bar Loads, with or without In-pavement & Elevated RGL Loads"]
[]
["In-pavement Stop Bar"]
[]
[null,"A.","Fixture Description",null,null,null,"L-852S"]
[]
[null,"B.","Fixture Manufacturer",null,null,null,"ADB Safegate"]
[]
[null,"C.","Fixture Load",null,null,null,53," W or VA (LED)"]
[]
[null,"D. ","Type of Control/Monitoring Device Used"]
[]
[null,null,"1. Max. Control/Monitoring Device Load",null,null,null,null," VA"]
[]
[null,"E.","Are long secondary wires present?",null,null,null,"Yes"]
[null,null,"Note: Zero is automatically assumed if transformer is located underneath fixture.  "]
[null,null,"1. Estimated roundtrip length of L-830 secondary wire",null,null,null,5,{"$f":"\" \" & 'Series Circuit Parameters'!$D$15 & \"\"","v":" Feet"}]
[]
[null,null,"2. L-830 Secondary Wire Gauge",null,null,null,16," AWG"]
{"$rows_left_out":117}
{"sheet":"Other Loads","index":7,"n_rows":89,"n_cols":14,"rows_kept":89,"cut":false,"hidden":false,"merged":[[2,0,86,0],[4,10,4,13],[3,2,3,5],[3,10,3,13],[54,2,54,5],[37,2,37,5],[37,10,37,13],[20,10,20,13],[20,2,20,5],[4,2,4,5],[72,2,72,5],[72,10,72,13],[87,1,87,9],[38,2,38,5],[38,10,38,13],[90,2,90,15],[21,2,21,5],[21,10,21,13],[22,2,22,5],[55,2,55,5],[55,10,55,13],[54,10,54,13],[71,10,71,13],[71,2,71,5]]}
[]
[null,"Other Load(s)",null,null,null,null,null,null,null,null,null,null,null,"* = Select from dropdown or type in value"]
[]
[null,"1.","Other Load Description (Select From Dropdown or Type-in)",null,null,null,null,null,null,"2.","Other Load Description (Select From Dropdown or Type-in)"]
[null,"*","4-Box (L-880) Type B (Current Driven) Single Channel PAPI",null,null,null,null,null,null,"*"]
[]
[null,null,"Device VA ",310," VA",null,null,null,null,null,"Device VA ",null," VA"]
[]
[null,null,"Isolation Transformer Used (if any) ",300," VA",null,null,null,null,null,"Isolation Transformer Used (if any) ",null," VA"]
[]
[null,null,"Isolation Transformer Losses (if any) ",{"$f":"IF(D9,VLOOKUP(D9,variables!$L$5:$M$17,2,FALSE),0)","v":30}," VA",null,null,null,null,null,"Isolation Transformer Losses (if any) ",{"$f":"IF(L9,VLOOKUP(L9,variables!$L$5:$M$17,2,FALSE),0)","v":0}," VA"]
[]
[null,null,"Other Losses (if any) ",null," VA",null,null,null,null,null,"Other Losses (if any) ",null," VA"]
[]
[null,null,"Quantity",1,null,null,null,null,null,null,"Quantity"]
[]
[null,null,"Total Load ",{"$f":"(D7+D11+D13)*D15","v":340}," VA",null,null,null,null,null,"Total Load ",{"$f":"(L7+L11+L13)*L15","v":0}," VA"]
[]
[]
[]
{"$rows_left_out":70}
{"sheet":"Load Summary","index":8,"n_rows":76,"n_cols":14,"rows_kept":76,"cut":false,"hidden":false,"merged":[[18,1,18,6],[73,0,73,1]]}
[]
[]
["CCR Load Summary"]
[]
["Airport Name",{"$f":"'Series Circuit Parameters'!D3 & \"\"","v":"<Enter Airport Name Here>"}]
[]
["Circuit Identification",{"$f":"'Series Circuit Parameters'!D5 & \"\"","v":"<Enter Circuit ID as required>"}]
[]
["Maximum CCR Output Current",{"$f":"'Series Circuit Parameters'!D7 & \"\"","v":"6.6"}]
[]
["Number of CCR Steps",{"$f":"'Series Circuit Parameters'!D9 & \"\"","v":"5-Step (2.8A-6.6A)"}]
[]
["Input Voltage",{"$f":"'Series Circuit Parameters'!D11 & \"\"","v":"480Vac"}]
[]
["Frequency",{"$f":"'Series Circuit Parameters'!D13 & \"\"","v":"60Hz"}]
[]
["CCR Architecture",{"$f":"'Series Circuit Parameters'!D17 & \"\"","v":"Ferroresonant"}]
[]
["Load Description","Device Description",null,null,null,null,null,"Manuf.","Isolation Transformer Used","Qty.","Individual Device CCR Load VA","Subtotal Load VA","Subtotal Load Type VA"]
["Lamp Load 1",{"$f":"'Lamp Load'!H6 & \"\"","v":"L-850C"},null,null,null,null,null,{"$f":"'Lamp Load'!H8 & \"\"","v":"ADB Safegate"},{"$f":"'Lamp Load'!H26 & \"W\"","v":"45W"},{"$f":"'Lamp Load'!H10","v":100},{"$f":"'Lamp Load'!H12","v":45},{"$f":"'Lamp Load'!L30","v":5700}]
{"$rows_left_out":57}
{"sheet":"variables","index":9,"n_rows":41,"n_cols":24,"rows_kept":41,"cut":false,"hidden":true,"merged":[[0,0,0,8],[0,10,0,14]]}
[null,null,null,null,null,null,null,null,null,{"$f":"IF('Series Circuit Parameters'!$D$15=\"Feet\",2,3)","v":2}]
[]
[]
["output",null,"frequency",null,"architecture",null,"units",null,"awg","f","m","watts","xfmrloss",null,"fixture","fixture2",null,"signtype"]
[6.6,null,"60Hz",null,"Ferroresonant",null,"Feet","AWG",6,0.42,5.61,10,3,null,"L-850A","L-850A(L)",null,"L-858Y - Direction/Destination/Boundary",null,"L-830-16","10/15","6.6A/6.6A",70,"3 / 4.5"]
[20,null,"50Hz",null,"Thyristor",null,"Meters","mm2",8,0.66,3.54,15,4.5,null,"L-850B","L-850B(L)",null,"L-858R - Mandatory",null,"L-830-17","20/25","6.6A/6.6A",70,"6 / 7.5"]
[null,null,null,null,"Other Manufacturer SCR",null,null,null,null,null,null,20,6,null,"L-850C","L-850C(L)",null,"L-858L - Runway/Taxiway Location",null,"L-830-1","30/45","6.6A/6.6A",80,"6/9"]
["signman",null,"signsize",null,null,null,"lamptype",null,12,1.71,2.16,25,7.5,null,"L-850D","L-850D(L)",null,"L-858B - Runway Distance Remaining",null,"L-830-2","30/45","20A/6.6A",80,"6/9"]
["ADB Safegate",null,"Size 1",null,"gendesc",null,"Halogen",null,16,4.3499999999999996,1.37,30,"6",null,"L-850E","L-850T(L)",null,null,null,"L-830-3",65,"6.6A/6.6A",80,13]
[null,null,"Size 2",null,"1 Module",null,"Fluorescent",null,null,null,null,45,"9",null,"L-850F","L-852A(L)",null,"signstyle",null,"L-830-4",100,"6.6A/6.6A",85,15]
["lampwatt",null,"Size 3",null,"2 Module",null,"LED",null,"lamparch",null,null,65,13,null,"L-852A","L-852B(L)",null,"Style 2 (4.8A - 6.6A) 3-step",null,"L-830-5",100,"20A/6.6A",85,15]
[105,null,"Size 4",null,"3 Module",null,null,null,"Low VA",null,null,100,15,null,"L-852B","L-852C(L)",null,"Style 3 (2.8A - 6.6A) 5-step",null,"L-830-18",150,"6.6A/6.6A",85,22.5]
[null,null,"Size 5",null,"4 Module",null,"watts2",null,"Standard VA",null,null,150,20,null,"L-852C","L-852D(L)",null,"Style 5 (5.5A only)",null,"L-830-19",150,"20A/20A",85,22.5]
["monitor",null,null,null,"700 mm",null,100,null,"5.5A (Single-step)",null,null,200,22.5,null,"L-852D","L-852J(L)",null,null,null,"L-830-6",200,"6.6A/6.6A",90,20]
["Monitored",null,"pulsing",null,"900 mm",null,null,null,"Fluorescent",null,null,300,30,null,"L-852E","L-852K(L)",null,"otherdesc",null,"L-830-7",200,"20A/6.6A",90,20]
["Un-Monitored",null,"BRITE II Single Remote",null,"1100 mm",null,"fixdesc",null,"FAA LED",null,null,500,"50",null,"L-852F","L-852S(L)",null,"L-849A/C/E REIL with PA-4",null,"L-830-8",300,"6.6A/20A",90,30]
[null,null,"BRITE III (AGLAS) Single Remote",null,"1300 mm",null,"L-852S",null,"ICAO LED (Single Sided) (600 mm)",null,null,1500,75,null,"L-852T","L-852T(L)",null,"L-849A/E LED REIL",null,"L-830-9",300,"20A/20A",90,30]
[null,null,"LINC 360 Single Remote",null,"1500 mm",null,"L-852G/S",null,"ICAO LED (Dual Sided) (600 mm)",null,null,null,null,null,"L-860","L-861(L)",null,"L-849C LED REIL",null,"L-830-10",300,"6.6A/6.6A",90,30]
[null,null,null,null,"1700 mm",null,null,null,"ICAO LED (Single Sided) (800 mm)",null,null,null,null,null,"L-860E","L-861E(L)",null,"4-Box (L-880) Type B (Current Driven) 2-Lamp Optical Box",null,"L-830-11",300,"20A/6.6A",90,30]
[null,null,"Thyristor",null,"1900 mm",null,"irgldesc",null,"ICAO LED (Dual Sided) (800 mm)",null,2.5,null,5.61,null,"L-861","L-861T(L)",null,"4-Box (L-880) Type B (Current Driven) 3-Lamp Optical Box",null,"L-830-12",500,"6.6A/20A",90,50]
{"$rows_left_out":22}
{"sheet":"SL Table","index":10,"n_rows":197,"n_cols":10,"rows_kept":197,"cut":false,"hidden":true,"merged":[]}
["type","architecture","style","Sign Size","watts","Modules","Transformer","Lamps","Power factor","load"]
["Halogen","Low Va",2,1,48,1,100,1,0.98,106]
["Halogen","Low Va",2,1,48,2,200,2,0.99,155]
["Halogen","Low Va",2,1,48,3,300,3,0.98,202]
["Halogen","Low Va",2,1,48,4,300,4,0.99,250]
["Halogen","Low Va",2,2,48,1,200,2,0.99,155]
["Halogen","Low Va",2,2,48,2,300,4,0.99,250]
["Halogen","Low Va",2,2,48,3,500,6,0.98,340]
["Halogen","Low Va",2,2,48,4,"300 (2)",8,0.97,450]
["Halogen","Low Va",2,3,48,1,200,2,0.99,155]
["Halogen","Low Va",2,3,48,2,300,4,0.99,250]
["Halogen","Low Va",2,3,48,3,500,6,0.98,340]
["Halogen","Low Va",2,3,48,4,"300 (2)",8,0.97,450]
["Halogen","Low Va",2,4,48,1,300,4,0.99,250]
["Halogen","Low Va",2,5,48,1,200,2,0.99,155]
["Halogen","Low Va",3,1,48,1,200,1,0.97,105]
["Halogen","Low Va",3,1,48,2,300,2,0.98,145]
["Halogen","Low Va",3,1,48,3,500,3,0.98,190]
["Halogen","Low Va",3,1,48,4,500,4,0.98,233]
["Halogen","Low Va",3,2,48,1,300,2,0.98,145]
{"$rows_left_out":177}